{"text_format":"3","workbook":"xlsx","n_sheets":5,"sheets":["基本入力","申込一覧（様式１）","リレー申込（様式2）","NANS競技者データ","CODE"],"not_rendered":{"external_links":1,"defined_names":11,"comments":2},"read":"whole","date_system":"1900"}

{"sheet":"基本入力","index":0,"n_rows":24,"n_cols":11,"rows_kept":24,"merged":[[11,1,17,1]]}
["大会名","第17回北海道高等学校体育連盟空知支部陸上競技選手権大会",{"$nulls":7},"学校名","略校名"]
["学校名",null,"←学校名をリストから選択してください",{"$nulls":5},1,"北海道岩見沢農業高等学校","岩見沢農業高"]
["顧問名①",null,"←顧問名を入力してください",{"$nulls":5},2,"北海道滝川高等学校","滝川高"]
["顧問名②",{"$nulls":7},3,"北海道滝川西高等学校","滝川西高"]
["顧問名③",{"$nulls":7},4,"北海道岩見沢東高等学校","岩見沢東高"]
["郵便番号",null,"←郵便番号を入力してください（全角）",{"$nulls":5},5,"北海道岩見沢緑陵高等学校","岩見沢緑陵高"]
["学校住所",null,"←住所を入力してください",{"$nulls":5},6,"北海道芦別高等学校","芦別高"]
["学校電話",null,"←電話番号を入力してください（全角）",{"$nulls":5},7,"北海道美唄尚栄高等学校","美唄尚栄高"]
["校長名",null,"←校長名を入力してください",{"$nulls":5},8,"北海道岩見沢西高等学校","岩見沢西高"]
["略校名",null,"←略校名をリストから選択してください",{"$nulls":5},9,"北海道栗山高等学校","砂川高"]
[{"$nulls":8},10,"北海道砂川高等学校","深川西高"]
[{"$nulls":8},11,"北海道深川西高等学校","深川東高"]
[{"$nulls":8},12,"北海道深川東高等学校","滝川工業高"]
[{"$nulls":8},13,"北海道滝川工業高等学校","月形高"]
[{"$nulls":8},14,"北海道月形高等学校","長沼高"]
{"$rows_left_out":10}
{"sheet":"申込一覧（様式１）","index":1,"n_rows":41,"n_cols":20,"rows_kept":41,"merged":[[0,0,0,8],[0,9,0,12],[1,0,1,12],[1,15,1,16],[2,0,4,0],[2,1,4,2],[2,3,4,3],[2,4,2,5],[2,6,3,6],[2,7,2,12],[2,14,5,14],[2,15,5,15],[2,16,5,16],[3,4,3,5],[3,7,3,12],[4,4,4,5],[4,7,4,12],[38,0,38,12],[39,0,39,1],[39,2,39,9],[39,10,39,12],[40,0,40,3],[40,5,40,6],[40,7,40,8],[40,9,40,11]]}
[{"$f":"基本入力!$B$1","v":"第17回北海道高等学校体育連盟空知支部陸上競技選手権大会"},{"$nulls":8},"参加申込一覧表（女子）（様式１）"]
["参　　　加　　　選　　　手　　　一　　　覧　　　表",{"$nulls":14},{"$f":"IF(B3=\"\",\"\",B3)","v":""}]
["学校名",{"$f":"IF(基本入力!B10=\"\",\"\",基本入力!$B$10)","v":""},null,"顧問名",{"$f":"IF(基本入力!B3=\"\",\"\",基本入力!$B$3)","v":""},null,"学校所在地　　　　　　　",{"$f":"IF(基本入力!B6=\"\",\"\",基本入力!$B$6)","v":""},{"$nulls":6},"種目","エントリー数","エントリー数\nチェック"]
[{"$nulls":4},{"$f":"IF(基本入力!B4=\"\",\"\",基本入力!$B$4)","v":""},null,null,{"$f":"IF(基本入力!B7=\"\",\"\",基本入力!$B$7)","v":""}]
[{"$nulls":4},{"$f":"IF(基本入力!B5=\"\",\"\",基本入力!$B$5)","v":""},null,"電話番号",{"$f":"IF(基本入力!B8=\"\",\"\",基本入力!$B$8)","v":""}]
[]
["番号","氏　　　　名","ﾌﾘｶﾞﾅ","学年","高校名","出場種目①","最高記録","出場種目②","最高記録","出場種目③","最高記録","4×100mR","4×400mR",null,"１００ｍ",{"$f":"COUNTIF($F$8:$M$37,O7)","v":0},{"$f":"IF(P7>3,\"4人以上エントリーしてます！！\",\"ＯＫ\")","v":"ＯＫ"},null,"滝川高","〇"]
[{"$nulls":4},{"$f":"IF(A8=\"\",\"\",基本入力!$B$10)","v":""},{"$nulls":8},1,"２００ｍ",{"$f":"COUNTIF($F$8:$M$37,O8)","v":0},{"$f":"IF(P8>3,\"4人以上エントリーしてます！！\",\"ＯＫ\")","v":"ＯＫ"},null,"滝川西高"]
[{"$nulls":4},{"$f":"IF(A9=\"\",\"\",基本入力!$B$10)","v":""},{"$nulls":8},2,"４００ｍ",0,"ＯＫ",null,"岩見沢東高"]
[{"$nulls":4},{"$f":"IF(A10=\"\",\"\",基本入力!$B$10)","v":""},{"$nulls":8},3,"８００ｍ",0,"ＯＫ",null,"岩見沢緑陵高"]
[{"$nulls":4},{"$f":"IF(A11=\"\",\"\",基本入力!$B$10)","v":""},{"$nulls":8},4,"１５００ｍ",0,"ＯＫ",null,"芦別高"]
[{"$nulls":4},{"$f":"IF(A12=\"\",\"\",基本入力!$B$10)","v":""},{"$nulls":8},5,"３０００ｍ",0,"ＯＫ",null,"美唄尚栄高"]
[{"$nulls":4},{"$f":"IF(A13=\"\",\"\",基本入力!$B$10)","v":""},{"$nulls":8},6,"１００ｍH",0,"ＯＫ",null,"岩見沢西高"]
[{"$nulls":4},{"$f":"IF(A14=\"\",\"\",基本入力!$B$10)","v":""},{"$nulls":8},7,"４００ｍH",0,"ＯＫ",null,"砂川高"]
[{"$nulls":4},{"$f":"IF(A15=\"\",\"\",基本入力!$B$10)","v":""},{"$nulls":8},8,"５０００ｍW",0,"ＯＫ",null,"深川西高"]
{"$rows_left_out":27}
{"sheet":"リレー申込（様式2）","index":2,"n_rows":53,"n_cols":25,"rows_kept":53,"merged":[[1,2,1,32],[4,3,4,9],[4,10,5,13],[4,14,4,31],[5,3,5,9],[5,14,5,31],[6,3,7,7],[6,8,6,20],[6,21,7,23],[6,24,7,31],[7,8,7,20],[8,3,10,7],[8,8,8,20],[8,21,10,23],[8,24,25,31],[9,8,10,20],[11,3,13,7],[11,8,11,20],[11,21,13,23],[12,8,13,20],[14,3,16,7],[14,8,14,20],[14,21,16,23],[15,8,16,20],[17,3,19,7],[17,8,17,20],[17,21,19,23],[18,8,19,20],[20,3,22,7],[20,8,20,20],[20,21,22,23],[21,8,22,20],[23,3,25,7],[23,8,23,20],[23,21,25,23],[24,8,25,20],[27,2,27,32],[29,2,29,32],[32,3,32,9],[32,10,33,13],[32,14,32,31],[33,3,33,9],[33,14,33,31],[34,3,35,7],[34,8,34,20],[34,21,35,23],[34,24,35,31],[35,8,35,20],[36,3,38,7],[36,8,36,20],[36,21,38,23],[36,24,53,31],[37,8,38,20],[39,3,41,7],[39,8,39,20],[39,21,41,23],[40,8,41,20],[42,3,44,7],[42,8,42,20],[42,21,44,23],[43,8,44,20],[45,3,47,7],[45,8,45,20],[45,21,47,23],[46,8,47,20],[48,3,50,7],[48,8,48,20],[48,21,50,23],[49,8,50,20],[51,3,53,7],[51,8,51,20],[51,21,53,23],[52,8,53,20]]}
[]
[null,null,{"$f":"基本入力!$B$1","v":"第17回北海道高等学校体育連盟空知支部陸上競技選手権大会"}]
[{"$nulls":20},"リレー申込書（様式２）"]
[]
[{"$nulls":3},"種　　目",{"$nulls":6},"女",{"$nulls":3},"最　高　記　録"]
[{"$nulls":3},"４×１００MR"]
[{"$nulls":3},"番　　号",{"$nulls":4},"（ﾌﾘｶﾞﾅ）",{"$nulls":12},"学年",null,null,"学校名"]
[{"$nulls":8},"氏　　　　　　名"]
[{"$nulls":8},{"$f":"IF(D9=\"\",\"\",VLOOKUP(D9,'申込一覧（様式１）'!$A$7:$D$37,3))","v":""},{"$nulls":12},{"$f":"IF(D9=\"\",\"\",VLOOKUP(D9,'申込一覧（様式１）'!$A$7:$D$37,4))","v":""},null,null,{"$f":"IF(基本入力!$B$10=\"\",\"\",基本入力!$B$10)","v":""}]
[{"$nulls":8},{"$f":"IF(D9=\"\",\"\",VLOOKUP(D9,'申込一覧（様式１）'!$A$7:$D$37,2))","v":""}]
[]
[{"$nulls":8},{"$f":"IF(D12=\"\",\"\",VLOOKUP(D12,'申込一覧（様式１）'!$A$7:$D$37,3))","v":""},{"$nulls":12},{"$f":"IF(D12=\"\",\"\",VLOOKUP(D12,'申込一覧（様式１）'!$A$7:$D$37,4))","v":""}]
[{"$nulls":8},{"$f":"IF(D12=\"\",\"\",VLOOKUP(D12,'申込一覧（様式１）'!$A$7:$D$37,2))","v":""}]
[]
[{"$nulls":8},{"$f":"IF(D15=\"\",\"\",VLOOKUP(D15,'申込一覧（様式１）'!$A$7:$D$37,3))","v":""},{"$nulls":12},{"$f":"IF(D15=\"\",\"\",VLOOKUP(D15,'申込一覧（様式１）'!$A$7:$D$37,4))","v":""}]
{"$rows_left_out":39}
{"sheet":"NANS競技者データ","index":3,"n_rows":31,"n_cols":36,"rows_kept":31,"hidden":true}
["競技者NO","所属コード1","所属コード2","ナンバー","ナンバー2","競技者名","競技者名カナ","競技者名略称","競技者名英字","国籍","性別","学年","生年","月日","個人所属地名","陸連コード","参加競技-競技コード1","参加競技-自己記録1","参加競技-オープン参加FLG1","参加競技-記録FLG1","参加競技-競技コード2","参加競技-自己記録2","参加競技-オープン参加FLG2","参加競技-記録FLG2","参加競技-競技コード3","参加競技-自己記録3","参加競技-オープン参加FLG3","参加競技-記録FLG3","参加競技-競技コード4","参加競技-自己記録4","参加競技-オープン参加FLG4","参加競技-記録FLG4","参加競技-競技コード5","参加競技-自己記録5","参加競技-オープン参加FLG5","参加競技-記録FLG5"]
[1,{"$f":"IF('申込一覧（様式１）'!E8=\"\",\"\",VLOOKUP('申込一覧（様式１）'!E8,CODE!$F$59:$G$80,2,FALSE))","v":""},null,null,{"$f":"IF('申込一覧（様式１）'!A8=\"\",\"\",'申込一覧（様式１）'!A8)","v":""},{"$f":"IF('申込一覧（様式１）'!B8=\"\",\"\",'申込一覧（様式１）'!B8)","v":""},{"$f":"IF('申込一覧（様式１）'!C8=\"\",\"\",'申込一覧（様式１）'!C8)","v":""},{"$f":"F2","v":""},null,null,{"$f":"IF(E2=\"\",\"\",2)","v":""},{"$f":"IF('申込一覧（様式１）'!D8=\"\",\"\",'申込一覧（様式１）'!D8)","v":""},null,0,"空知",49,{"$f":"IF('申込一覧（様式１）'!F8=\"\",\"\",VLOOKUP('申込一覧（様式１）'!F8,CODE!$P$3:$R$39,2,FALSE))","v":""},{"$f":"IF('申込一覧（様式１）'!G8=\"\",\"\",'申込一覧（様式１）'!G8)","v":""},{"$f":"IF(Q2=\"\",\"\",0)","v":""},{"$f":"IF('申込一覧（様式１）'!F8=\"\",\"\",VLOOKUP('申込一覧（様式１）'!F8,CODE!$P$3:$R$39,3,FALSE))","v":""},{"$f":"IF('申込一覧（様式１）'!H8=\"\",\"\",VLOOKUP('申込一覧（様式１）'!H8,CODE!$P$3:$R$39,2,FALSE))","v":""},{"$f":"IF('申込一覧（様式１）'!I8=\"\",\"\",'申込一覧（様式１）'!I8)","v":""},{"$f":"IF('申込一覧（様式１）'!H8=\"\",\"\",0)","v":""},{"$f":"IF('申込一覧（様式１）'!H8=\"\",\"\",VLOOKUP('申込一覧（様式１）'!H8,CODE!$P$3:$R$39,3,FALSE))","v":""},{"$f":"IF('申込一覧（様式１）'!J8=\"\",\"\",VLOOKUP('申込一覧（様式１）'!J8,CODE!$P$3:$R$39,2,FALSE))","v":""},{"$f":"IF('申込一覧（様式１）'!K8=\"\",\"\",'申込一覧（様式１）'!K8)","v":""},{"$f":"IF('申込一覧（様式１）'!J8=\"\",\"\",0)","v":""},{"$f":"IF('申込一覧（様式１）'!J8=\"\",\"\",VLOOKUP('申込一覧（様式１）'!J8,CODE!$P$3:$R$39,3,FALSE))","v":""}]
[2,{"$f":"IF('申込一覧（様式１）'!E9=\"\",\"\",VLOOKUP('申込一覧（様式１）'!E9,CODE!$F$59:$G$80,2,FALSE))","v":""},null,null,{"$f":"IF('申込一覧（様式１）'!A9=\"\",\"\",'申込一覧（様式１）'!A9)","v":""},{"$f":"IF('申込一覧（様式１）'!B9=\"\",\"\",'申込一覧（様式１）'!B9)","v":""},{"$f":"IF('申込一覧（様式１）'!C9=\"\",\"\",'申込一覧（様式１）'!C9)","v":""},{"$f":"F3","v":""},null,null,{"$f":"IF(E3=\"\",\"\",2)","v":""},{"$f":"IF('申込一覧（様式１）'!D9=\"\",\"\",'申込一覧（様式１）'!D9)","v":""},null,0,"空知",49,{"$f":"IF('申込一覧（様式１）'!F9=\"\",\"\",VLOOKUP('申込一覧（様式１）'!F9,CODE!$P$3:$R$39,2,FALSE))","v":""},{"$f":"IF('申込一覧（様式１）'!G9=\"\",\"\",'申込一覧（様式１）'!G9)","v":""},{"$f":"IF(Q3=\"\",\"\",0)","v":""},{"$f":"IF('申込一覧（様式１）'!F9=\"\",\"\",VLOOKUP('申込一覧（様式１）'!F9,CODE!$P$3:$R$39,3,FALSE))","v":""},{"$f":"IF('申込一覧（様式１）'!H9=\"\",\"\",VLOOKUP('申込一覧（様式１）'!H9,CODE!$P$3:$R$39,2,FALSE))","v":""},{"$f":"IF('申込一覧（様式１）'!I9=\"\",\"\",'申込一覧（様式１）'!I9)","v":""},{"$f":"IF('申込一覧（様式１）'!H9=\"\",\"\",0)","v":""},{"$f":"IF('申込一覧（様式１）'!H9=\"\",\"\",VLOOKUP('申込一覧（様式１）'!H9,CODE!$P$3:$R$39,3,FALSE))","v":""},{"$f":"IF('申込一覧（様式１）'!J9=\"\",\"\",VLOOKUP('申込一覧（様式１）'!J9,CODE!$P$3:$R$39,2,FALSE))","v":""},{"$f":"IF('申込一覧（様式１）'!K9=\"\",\"\",'申込一覧（様式１）'!K9)","v":""},{"$f":"IF('申込一覧（様式１）'!J9=\"\",\"\",0)","v":""},{"$f":"IF('申込一覧（様式１）'!J9=\"\",\"\",VLOOKUP('申込一覧（様式１）'!J9,CODE!$P$3:$R$39,3,FALSE))","v":""}]
[3,{"$f":"IF('申込一覧（様式１）'!E10=\"\",\"\",VLOOKUP('申込一覧（様式１）'!E10,CODE!$F$59:$G$80,2,FALSE))","v":""},null,null,{"$f":"IF('申込一覧（様式１）'!A10=\"\",\"\",'申込一覧（様式１）'!A10)","v":""},{"$f":"IF('申込一覧（様式１）'!B10=\"\",\"\",'申込一覧（様式１）'!B10)","v":""},{"$f":"IF('申込一覧（様式１）'!C10=\"\",\"\",'申込一覧（様式１）'!C10)","v":""},"",null,null,"",{"$f":"IF('申込一覧（様式１）'!D10=\"\",\"\",'申込一覧（様式１）'!D10)","v":""},null,0,"空知",49,{"$f":"IF('申込一覧（様式１）'!F10=\"\",\"\",VLOOKUP('申込一覧（様式１）'!F10,CODE!$P$3:$R$39,2,FALSE))","v":""},{"$f":"IF('申込一覧（様式１）'!G10=\"\",\"\",'申込一覧（様式１）'!G10)","v":""},"",{"$f":"IF('申込一覧（様式１）'!F10=\"\",\"\",VLOOKUP('申込一覧（様式１）'!F10,CODE!$P$3:$R$39,3,FALSE))","v":""},{"$f":"IF('申込一覧（様式１）'!H10=\"\",\"\",VLOOKUP('申込一覧（様式１）'!H10,CODE!$P$3:$R$39,2,FALSE))","v":""},{"$f":"IF('申込一覧（様式１）'!I10=\"\",\"\",'申込一覧（様式１）'!I10)","v":""},{"$f":"IF('申込一覧（様式１）'!H10=\"\",\"\",0)","v":""},{"$f":"IF('申込一覧（様式１）'!H10=\"\",\"\",VLOOKUP('申込一覧（様式１）'!H10,CODE!$P$3:$R$39,3,FALSE))","v":""},{"$f":"IF('申込一覧（様式１）'!J10=\"\",\"\",VLOOKUP('申込一覧（様式１）'!J10,CODE!$P$3:$R$39,2,FALSE))","v":""},{"$f":"IF('申込一覧（様式１）'!K10=\"\",\"\",'申込一覧（様式１）'!K10)","v":""},{"$f":"IF('申込一覧（様式１）'!J10=\"\",\"\",0)","v":""},{"$f":"IF('申込一覧（様式１）'!J10=\"\",\"\",VLOOKUP('申込一覧（様式１）'!J10,CODE!$P$3:$R$39,3,FALSE))","v":""}]
[4,{"$f":"IF('申込一覧（様式１）'!E11=\"\",\"\",VLOOKUP('申込一覧（様式１）'!E11,CODE!$F$59:$G$80,2,FALSE))","v":""},null,null,{"$f":"IF('申込一覧（様式１）'!A11=\"\",\"\",'申込一覧（様式１）'!A11)","v":""},{"$f":"IF('申込一覧（様式１）'!B11=\"\",\"\",'申込一覧（様式１）'!B11)","v":""},{"$f":"IF('申込一覧（様式１）'!C11=\"\",\"\",'申込一覧（様式１）'!C11)","v":""},"",null,null,"",{"$f":"IF('申込一覧（様式１）'!D11=\"\",\"\",'申込一覧（様式１）'!D11)","v":""},null,0,"空知",49,{"$f":"IF('申込一覧（様式１）'!F11=\"\",\"\",VLOOKUP('申込一覧（様式１）'!F11,CODE!$P$3:$R$39,2,FALSE))","v":""},{"$f":"IF('申込一覧（様式１）'!G11=\"\",\"\",'申込一覧（様式１）'!G11)","v":""},"",{"$f":"IF('申込一覧（様式１）'!F11=\"\",\"\",VLOOKUP('申込一覧（様式１）'!F11,CODE!$P$3:$R$39,3,FALSE))","v":""},{"$f":"IF('申込一覧（様式１）'!H11=\"\",\"\",VLOOKUP('申込一覧（様式１）'!H11,CODE!$P$3:$R$39,2,FALSE))","v":""},{"$f":"IF('申込一覧（様式１）'!I11=\"\",\"\",'申込一覧（様式１）'!I11)","v":""},{"$f":"IF('申込一覧（様式１）'!H11=\"\",\"\",0)","v":""},{"$f":"IF('申込一覧（様式１）'!H11=\"\",\"\",VLOOKUP('申込一覧（様式１）'!H11,CODE!$P$3:$R$39,3,FALSE))","v":""},{"$f":"IF('申込一覧（様式１）'!J11=\"\",\"\",VLOOKUP('申込一覧（様式１）'!J11,CODE!$P$3:$R$39,2,FALSE))","v":""},{"$f":"IF('申込一覧（様式１）'!K11=\"\",\"\",'申込一覧（様式１）'!K11)","v":""},{"$f":"IF('申込一覧（様式１）'!J11=\"\",\"\",0)","v":""},{"$f":"IF('申込一覧（様式１）'!J11=\"\",\"\",VLOOKUP('申込一覧（様式１）'!J11,CODE!$P$3:$R$39,3,FALSE))","v":""}]
[5,{"$f":"IF('申込一覧（様式１）'!E12=\"\",\"\",VLOOKUP('申込一覧（様式１）'!E12,CODE!$F$59:$G$80,2,FALSE))","v":""},null,null,{"$f":"IF('申込一覧（様式１）'!A12=\"\",\"\",'申込一覧（様式１）'!A12)","v":""},{"$f":"IF('申込一覧（様式１）'!B12=\"\",\"\",'申込一覧（様式１）'!B12)","v":""},{"$f":"IF('申込一覧（様式１）'!C12=\"\",\"\",'申込一覧（様式１）'!C12)","v":""},"",null,null,"",{"$f":"IF('申込一覧（様式１）'!D12=\"\",\"\",'申込一覧（様式１）'!D12)","v":""},null,0,"空知",49,{"$f":"IF('申込一覧（様式１）'!F12=\"\",\"\",VLOOKUP('申込一覧（様式１）'!F12,CODE!$P$3:$R$39,2,FALSE))","v":""},{"$f":"IF('申込一覧（様式１）'!G12=\"\",\"\",'申込一覧（様式１）'!G12)","v":""},"",{"$f":"IF('申込一覧（様式１）'!F12=\"\",\"\",VLOOKUP('申込一覧（様式１）'!F12,CODE!$P$3:$R$39,3,FALSE))","v":""},{"$f":"IF('申込一覧（様式１）'!H12=\"\",\"\",VLOOKUP('申込一覧（様式１）'!H12,CODE!$P$3:$R$39,2,FALSE))","v":""},{"$f":"IF('申込一覧（様式１）'!I12=\"\",\"\",'申込一覧（様式１）'!I12)","v":""},{"$f":"IF('申込一覧（様式１）'!H12=\"\",\"\",0)","v":""},{"$f":"IF('申込一覧（様式１）'!H12=\"\",\"\",VLOOKUP('申込一覧（様式１）'!H12,CODE!$P$3:$R$39,3,FALSE))","v":""},{"$f":"IF('申込一覧（様式１）'!J12=\"\",\"\",VLOOKUP('申込一覧（様式１）'!J12,CODE!$P$3:$R$39,2,FALSE))","v":""},{"$f":"IF('申込一覧（様式１）'!K12=\"\",\"\",'申込一覧（様式１）'!K12)","v":""},{"$f":"IF('申込一覧（様式１）'!J12=\"\",\"\",0)","v":""},{"$f":"IF('申込一覧（様式１）'!J12=\"\",\"\",VLOOKUP('申込一覧（様式１）'!J12,CODE!$P$3:$R$39,3,FALSE))","v":""}]
[6,{"$f":"IF('申込一覧（様式１）'!E13=\"\",\"\",VLOOKUP('申込一覧（様式１）'!E13,CODE!$F$59:$G$80,2,FALSE))","v":""},null,null,{"$f":"IF('申込一覧（様式１）'!A13=\"\",\"\",'申込一覧（様式１）'!A13)","v":""},{"$f":"IF('申込一覧（様式１）'!B13=\"\",\"\",'申込一覧（様式１）'!B13)","v":""},{"$f":"IF('申込一覧（様式１）'!C13=\"\",\"\",'申込一覧（様式１）'!C13)","v":""},"",null,null,"",{"$f":"IF('申込一覧（様式１）'!D13=\"\",\"\",'申込一覧（様式１）'!D13)","v":""},null,0,"空知",49,{"$f":"IF('申込一覧（様式１）'!F13=\"\",\"\",VLOOKUP('申込一覧（様式１）'!F13,CODE!$P$3:$R$39,2,FALSE))","v":""},{"$f":"IF('申込一覧（様式１）'!G13=\"\",\"\",'申込一覧（様式１）'!G13)","v":""},"",{"$f":"IF('申込一覧（様式１）'!F13=\"\",\"\",VLOOKUP('申込一覧（様式１）'!F13,CODE!$P$3:$R$39,3,FALSE))","v":""},{"$f":"IF('申込一覧（様式１）'!H13=\"\",\"\",VLOOKUP('申込一覧（様式１）'!H13,CODE!$P$3:$R$39,2,FALSE))","v":""},{"$f":"IF('申込一覧（様式１）'!I13=\"\",\"\",'申込一覧（様式１）'!I13)","v":""},{"$f":"IF('申込一覧（様式１）'!H13=\"\",\"\",0)","v":""},{"$f":"IF('申込一覧（様式１）'!H13=\"\",\"\",VLOOKUP('申込一覧（様式１）'!H13,CODE!$P$3:$R$39,3,FALSE))","v":""},{"$f":"IF('申込一覧（様式１）'!J13=\"\",\"\",VLOOKUP('申込一覧（様式１）'!J13,CODE!$P$3:$R$39,2,FALSE))","v":""},{"$f":"IF('申込一覧（様式１）'!K13=\"\",\"\",'申込一覧（様式１）'!K13)","v":""},{"$f":"IF('申込一覧（様式１）'!J13=\"\",\"\",0)","v":""},{"$f":"IF('申込一覧（様式１）'!J13=\"\",\"\",VLOOKUP('申込一覧（様式１）'!J13,CODE!$P$3:$R$39,3,FALSE))","v":""}]
[7,{"$f":"IF('申込一覧（様式１）'!E14=\"\",\"\",VLOOKUP('申込一覧（様式１）'!E14,CODE!$F$59:$G$80,2,FALSE))","v":""},null,null,{"$f":"IF('申込一覧（様式１）'!A14=\"\",\"\",'申込一覧（様式１）'!A14)","v":""},{"$f":"IF('申込一覧（様式１）'!B14=\"\",\"\",'申込一覧（様式１）'!B14)","v":""},{"$f":"IF('申込一覧（様式１）'!C14=\"\",\"\",'申込一覧（様式１）'!C14)","v":""},"",null,null,"",{"$f":"IF('申込一覧（様式１）'!D14=\"\",\"\",'申込一覧（様式１）'!D14)","v":""},null,0,"空知",49,{"$f":"IF('申込一覧（様式１）'!F14=\"\",\"\",VLOOKUP('申込一覧（様式１）'!F14,CODE!$P$3:$R$39,2,FALSE))","v":""},{"$f":"IF('申込一覧（様式１）'!G14=\"\",\"\",'申込一覧（様式１）'!G14)","v":""},"",{"$f":"IF('申込一覧（様式１）'!F14=\"\",\"\",VLOOKUP('申込一覧（様式１）'!F14,CODE!$P$3:$R$39,3,FALSE))","v":""},{"$f":"IF('申込一覧（様式１）'!H14=\"\",\"\",VLOOKUP('申込一覧（様式１）'!H14,CODE!$P$3:$R$39,2,FALSE))","v":""},{"$f":"IF('申込一覧（様式１）'!I14=\"\",\"\",'申込一覧（様式１）'!I14)","v":""},{"$f":"IF('申込一覧（様式１）'!H14=\"\",\"\",0)","v":""},{"$f":"IF('申込一覧（様式１）'!H14=\"\",\"\",VLOOKUP('申込一覧（様式１）'!H14,CODE!$P$3:$R$39,3,FALSE))","v":""},{"$f":"IF('申込一覧（様式１）'!J14=\"\",\"\",VLOOKUP('申込一覧（様式１）'!J14,CODE!$P$3:$R$39,2,FALSE))","v":""},{"$f":"IF('申込一覧（様式１）'!K14=\"\",\"\",'申込一覧（様式１）'!K14)","v":""},{"$f":"IF('申込一覧（様式１）'!J14=\"\",\"\",0)","v":""},{"$f":"IF('申込一覧（様式１）'!J14=\"\",\"\",VLOOKUP('申込一覧（様式１）'!J14,CODE!$P$3:$R$39,3,FALSE))","v":""}]
[8,{"$f":"IF('申込一覧（様式１）'!E15=\"\",\"\",VLOOKUP('申込一覧（様式１）'!E15,CODE!$F$59:$G$80,2,FALSE))","v":""},null,null,{"$f":"IF('申込一覧（様式１）'!A15=\"\",\"\",'申込一覧（様式１）'!A15)","v":""},{"$f":"IF('申込一覧（様式１）'!B15=\"\",\"\",'申込一覧（様式１）'!B15)","v":""},{"$f":"IF('申込一覧（様式１）'!C15=\"\",\"\",'申込一覧（様式１）'!C15)","v":""},"",null,null,"",{"$f":"IF('申込一覧（様式１）'!D15=\"\",\"\",'申込一覧（様式１）'!D15)","v":""},null,0,"空知",49,{"$f":"IF('申込一覧（様式１）'!F15=\"\",\"\",VLOOKUP('申込一覧（様式１）'!F15,CODE!$P$3:$R$39,2,FALSE))","v":""},{"$f":"IF('申込一覧（様式１）'!G15=\"\",\"\",'申込一覧（様式１）'!G15)","v":""},"",{"$f":"IF('申込一覧（様式１）'!F15=\"\",\"\",VLOOKUP('申込一覧（様式１）'!F15,CODE!$P$3:$R$39,3,FALSE))","v":""},{"$f":"IF('申込一覧（様式１）'!H15=\"\",\"\",VLOOKUP('申込一覧（様式１）'!H15,CODE!$P$3:$R$39,2,FALSE))","v":""},{"$f":"IF('申込一覧（様式１）'!I15=\"\",\"\",'申込一覧（様式１）'!I15)","v":""},{"$f":"IF('申込一覧（様式１）'!H15=\"\",\"\",0)","v":""},{"$f":"IF('申込一覧（様式１）'!H15=\"\",\"\",VLOOKUP('申込一覧（様式１）'!H15,CODE!$P$3:$R$39,3,FALSE))","v":""},{"$f":"IF('申込一覧（様式１）'!J15=\"\",\"\",VLOOKUP('申込一覧（様式１）'!J15,CODE!$P$3:$R$39,2,FALSE))","v":""},{"$f":"IF('申込一覧（様式１）'!K15=\"\",\"\",'申込一覧（様式１）'!K15)","v":""},{"$f":"IF('申込一覧（様式１）'!J15=\"\",\"\",0)","v":""},{"$f":"IF('申込一覧（様式１）'!J15=\"\",\"\",VLOOKUP('申込一覧（様式１）'!J15,CODE!$P$3:$R$39,3,FALSE))","v":""}]
[9,{"$f":"IF('申込一覧（様式１）'!E16=\"\",\"\",VLOOKUP('申込一覧（様式１）'!E16,CODE!$F$59:$G$80,2,FALSE))","v":""},null,null,{"$f":"IF('申込一覧（様式１）'!A16=\"\",\"\",'申込一覧（様式１）'!A16)","v":""},{"$f":"IF('申込一覧（様式１）'!B16=\"\",\"\",'申込一覧（様式１）'!B16)","v":""},{"$f":"IF('申込一覧（様式１）'!C16=\"\",\"\",'申込一覧（様式１）'!C16)","v":""},"",null,null,"",{"$f":"IF('申込一覧（様式１）'!D16=\"\",\"\",'申込一覧（様式１）'!D16)","v":""},null,0,"空知",49,{"$f":"IF('申込一覧（様式１）'!F16=\"\",\"\",VLOOKUP('申込一覧（様式１）'!F16,CODE!$P$3:$R$39,2,FALSE))","v":""},{"$f":"IF('申込一覧（様式１）'!G16=\"\",\"\",'申込一覧（様式１）'!G16)","v":""},"",{"$f":"IF('申込一覧（様式１）'!F16=\"\",\"\",VLOOKUP('申込一覧（様式１）'!F16,CODE!$P$3:$R$39,3,FALSE))","v":""},{"$f":"IF('申込一覧（様式１）'!H16=\"\",\"\",VLOOKUP('申込一覧（様式１）'!H16,CODE!$P$3:$R$39,2,FALSE))","v":""},{"$f":"IF('申込一覧（様式１）'!I16=\"\",\"\",'申込一覧（様式１）'!I16)","v":""},{"$f":"IF('申込一覧（様式１）'!H16=\"\",\"\",0)","v":""},{"$f":"IF('申込一覧（様式１）'!H16=\"\",\"\",VLOOKUP('申込一覧（様式１）'!H16,CODE!$P$3:$R$39,3,FALSE))","v":""},{"$f":"IF('申込一覧（様式１）'!J16=\"\",\"\",VLOOKUP('申込一覧（様式１）'!J16,CODE!$P$3:$R$39,2,FALSE))","v":""},{"$f":"IF('申込一覧（様式１）'!K16=\"\",\"\",'申込一覧（様式１）'!K16)","v":""},{"$f":"IF('申込一覧（様式１）'!J16=\"\",\"\",0)","v":""},{"$f":"IF('申込一覧（様式１）'!J16=\"\",\"\",VLOOKUP('申込一覧（様式１）'!J16,CODE!$P$3:$R$39,3,FALSE))","v":""}]
[10,{"$f":"IF('申込一覧（様式１）'!E17=\"\",\"\",VLOOKUP('申込一覧（様式１）'!E17,CODE!$F$59:$G$80,2,FALSE))","v":""},null,null,{"$f":"IF('申込一覧（様式１）'!A17=\"\",\"\",'申込一覧（様式１）'!A17)","v":""},{"$f":"IF('申込一覧（様式１）'!B17=\"\",\"\",'申込一覧（様式１）'!B17)","v":""},{"$f":"IF('申込一覧（様式１）'!C17=\"\",\"\",'申込一覧（様式１）'!C17)","v":""},"",null,null,"",{"$f":"IF('申込一覧（様式１）'!D17=\"\",\"\",'申込一覧（様式１）'!D17)","v":""},null,0,"空知",49,{"$f":"IF('申込一覧（様式１）'!F17=\"\",\"\",VLOOKUP('申込一覧（様式１）'!F17,CODE!$P$3:$R$39,2,FALSE))","v":""},{"$f":"IF('申込一覧（様式１）'!G17=\"\",\"\",'申込一覧（様式１）'!G17)","v":""},"",{"$f":"IF('申込一覧（様式１）'!F17=\"\",\"\",VLOOKUP('申込一覧（様式１）'!F17,CODE!$P$3:$R$39,3,FALSE))","v":""},{"$f":"IF('申込一覧（様式１）'!H17=\"\",\"\",VLOOKUP('申込一覧（様式１）'!H17,CODE!$P$3:$R$39,2,FALSE))","v":""},{"$f":"IF('申込一覧（様式１）'!I17=\"\",\"\",'申込一覧（様式１）'!I17)","v":""},{"$f":"IF('申込一覧（様式１）'!H17=\"\",\"\",0)","v":""},{"$f":"IF('申込一覧（様式１）'!H17=\"\",\"\",VLOOKUP('申込一覧（様式１）'!H17,CODE!$P$3:$R$39,3,FALSE))","v":""},{"$f":"IF('申込一覧（様式１）'!J17=\"\",\"\",VLOOKUP('申込一覧（様式１）'!J17,CODE!$P$3:$R$39,2,FALSE))","v":""},{"$f":"IF('申込一覧（様式１）'!K17=\"\",\"\",'申込一覧（様式１）'!K17)","v":""},{"$f":"IF('申込一覧（様式１）'!J17=\"\",\"\",0)","v":""},{"$f":"IF('申込一覧（様式１）'!J17=\"\",\"\",VLOOKUP('申込一覧（様式１）'!J17,CODE!$P$3:$R$39,3,FALSE))","v":""}]
[11,{"$f":"IF('申込一覧（様式１）'!E18=\"\",\"\",VLOOKUP('申込一覧（様式１）'!E18,CODE!$F$59:$G$80,2,FALSE))","v":""},null,null,{"$f":"IF('申込一覧（様式１）'!A18=\"\",\"\",'申込一覧（様式１）'!A18)","v":""},{"$f":"IF('申込一覧（様式１）'!B18=\"\",\"\",'申込一覧（様式１）'!B18)","v":""},{"$f":"IF('申込一覧（様式１）'!C18=\"\",\"\",'申込一覧（様式１）'!C18)","v":""},"",null,null,"",{"$f":"IF('申込一覧（様式１）'!D18=\"\",\"\",'申込一覧（様式１）'!D18)","v":""},null,0,"空知",49,{"$f":"IF('申込一覧（様式１）'!F18=\"\",\"\",VLOOKUP('申込一覧（様式１）'!F18,CODE!$P$3:$R$39,2,FALSE))","v":""},{"$f":"IF('申込一覧（様式１）'!G18=\"\",\"\",'申込一覧（様式１）'!G18)","v":""},"",{"$f":"IF('申込一覧（様式１）'!F18=\"\",\"\",VLOOKUP('申込一覧（様式１）'!F18,CODE!$P$3:$R$39,3,FALSE))","v":""},{"$f":"IF('申込一覧（様式１）'!H18=\"\",\"\",VLOOKUP('申込一覧（様式１）'!H18,CODE!$P$3:$R$39,2,FALSE))","v":""},{"$f":"IF('申込一覧（様式１）'!I18=\"\",\"\",'申込一覧（様式１）'!I18)","v":""},{"$f":"IF('申込一覧（様式１）'!H18=\"\",\"\",0)","v":""},{"$f":"IF('申込一覧（様式１）'!H18=\"\",\"\",VLOOKUP('申込一覧（様式１）'!H18,CODE!$P$3:$R$39,3,FALSE))","v":""},{"$f":"IF('申込一覧（様式１）'!J18=\"\",\"\",VLOOKUP('申込一覧（様式１）'!J18,CODE!$P$3:$R$39,2,FALSE))","v":""},{"$f":"IF('申込一覧（様式１）'!K18=\"\",\"\",'申込一覧（様式１）'!K18)","v":""},{"$f":"IF('申込一覧（様式１）'!J18=\"\",\"\",0)","v":""},{"$f":"IF('申込一覧（様式１）'!J18=\"\",\"\",VLOOKUP('申込一覧（様式１）'!J18,CODE!$P$3:$R$39,3,FALSE))","v":""}]
[12,{"$f":"IF('申込一覧（様式１）'!E19=\"\",\"\",VLOOKUP('申込一覧（様式１）'!E19,CODE!$F$59:$G$80,2,FALSE))","v":""},null,null,{"$f":"IF('申込一覧（様式１）'!A19=\"\",\"\",'申込一覧（様式１）'!A19)","v":""},{"$f":"IF('申込一覧（様式１）'!B19=\"\",\"\",'申込一覧（様式１）'!B19)","v":""},{"$f":"IF('申込一覧（様式１）'!C19=\"\",\"\",'申込一覧（様式１）'!C19)","v":""},"",null,null,"",{"$f":"IF('申込一覧（様式１）'!D19=\"\",\"\",'申込一覧（様式１）'!D19)","v":""},null,0,"空知",49,{"$f":"IF('申込一覧（様式１）'!F19=\"\",\"\",VLOOKUP('申込一覧（様式１）'!F19,CODE!$P$3:$R$39,2,FALSE))","v":""},{"$f":"IF('申込一覧（様式１）'!G19=\"\",\"\",'申込一覧（様式１）'!G19)","v":""},"",{"$f":"IF('申込一覧（様式１）'!F19=\"\",\"\",VLOOKUP('申込一覧（様式１）'!F19,CODE!$P$3:$R$39,3,FALSE))","v":""},{"$f":"IF('申込一覧（様式１）'!H19=\"\",\"\",VLOOKUP('申込一覧（様式１）'!H19,CODE!$P$3:$R$39,2,FALSE))","v":""},{"$f":"IF('申込一覧（様式１）'!I19=\"\",\"\",'申込一覧（様式１）'!I19)","v":""},{"$f":"IF('申込一覧（様式１）'!H19=\"\",\"\",0)","v":""},{"$f":"IF('申込一覧（様式１）'!H19=\"\",\"\",VLOOKUP('申込一覧（様式１）'!H19,CODE!$P$3:$R$39,3,FALSE))","v":""},{"$f":"IF('申込一覧（様式１）'!J19=\"\",\"\",VLOOKUP('申込一覧（様式１）'!J19,CODE!$P$3:$R$39,2,FALSE))","v":""},{"$f":"IF('申込一覧（様式１）'!K19=\"\",\"\",'申込一覧（様式１）'!K19)","v":""},{"$f":"IF('申込一覧（様式１）'!J19=\"\",\"\",0)","v":""},{"$f":"IF('申込一覧（様式１）'!J19=\"\",\"\",VLOOKUP('申込一覧（様式１）'!J19,CODE!$P$3:$R$39,3,FALSE))","v":""}]
[13,{"$f":"IF('申込一覧（様式１）'!E20=\"\",\"\",VLOOKUP('申込一覧（様式１）'!E20,CODE!$F$59:$G$80,2,FALSE))","v":""},null,null,{"$f":"IF('申込一覧（様式１）'!A20=\"\",\"\",'申込一覧（様式１）'!A20)","v":""},{"$f":"IF('申込一覧（様式１）'!B20=\"\",\"\",'申込一覧（様式１）'!B20)","v":""},{"$f":"IF('申込一覧（様式１）'!C20=\"\",\"\",'申込一覧（様式１）'!C20)","v":""},"",null,null,"",{"$f":"IF('申込一覧（様式１）'!D20=\"\",\"\",'申込一覧（様式１）'!D20)","v":""},null,0,"空知",49,{"$f":"IF('申込一覧（様式１）'!F20=\"\",\"\",VLOOKUP('申込一覧（様式１）'!F20,CODE!$P$3:$R$39,2,FALSE))","v":""},{"$f":"IF('申込一覧（様式１）'!G20=\"\",\"\",'申込一覧（様式１）'!G20)","v":""},"",{"$f":"IF('申込一覧（様式１）'!F20=\"\",\"\",VLOOKUP('申込一覧（様式１）'!F20,CODE!$P$3:$R$39,3,FALSE))","v":""},{"$f":"IF('申込一覧（様式１）'!H20=\"\",\"\",VLOOKUP('申込一覧（様式１）'!H20,CODE!$P$3:$R$39,2,FALSE))","v":""},{"$f":"IF('申込一覧（様式１）'!I20=\"\",\"\",'申込一覧（様式１）'!I20)","v":""},{"$f":"IF('申込一覧（様式１）'!H20=\"\",\"\",0)","v":""},{"$f":"IF('申込一覧（様式１）'!H20=\"\",\"\",VLOOKUP('申込一覧（様式１）'!H20,CODE!$P$3:$R$39,3,FALSE))","v":""},{"$f":"IF('申込一覧（様式１）'!J20=\"\",\"\",VLOOKUP('申込一覧（様式１）'!J20,CODE!$P$3:$R$39,2,FALSE))","v":""},{"$f":"IF('申込一覧（様式１）'!K20=\"\",\"\",'申込一覧（様式１）'!K20)","v":""},{"$f":"IF('申込一覧（様式１）'!J20=\"\",\"\",0)","v":""},{"$f":"IF('申込一覧（様式１）'!J20=\"\",\"\",VLOOKUP('申込一覧（様式１）'!J20,CODE!$P$3:$R$39,3,FALSE))","v":""}]
[14,{"$f":"IF('申込一覧（様式１）'!E21=\"\",\"\",VLOOKUP('申込一覧（様式１）'!E21,CODE!$F$59:$G$80,2,FALSE))","v":""},null,null,{"$f":"IF('申込一覧（様式１）'!A21=\"\",\"\",'申込一覧（様式１）'!A21)","v":""},{"$f":"IF('申込一覧（様式１）'!B21=\"\",\"\",'申込一覧（様式１）'!B21)","v":""},{"$f":"IF('申込一覧（様式１）'!C21=\"\",\"\",'申込一覧（様式１）'!C21)","v":""},"",null,null,"",{"$f":"IF('申込一覧（様式１）'!D21=\"\",\"\",'申込一覧（様式１）'!D21)","v":""},null,0,"空知",49,{"$f":"IF('申込一覧（様式１）'!F21=\"\",\"\",VLOOKUP('申込一覧（様式１）'!F21,CODE!$P$3:$R$39,2,FALSE))","v":""},{"$f":"IF('申込一覧（様式１）'!G21=\"\",\"\",'申込一覧（様式１）'!G21)","v":""},"",{"$f":"IF('申込一覧（様式１）'!F21=\"\",\"\",VLOOKUP('申込一覧（様式１）'!F21,CODE!$P$3:$R$39,3,FALSE))","v":""},{"$f":"IF('申込一覧（様式１）'!H21=\"\",\"\",VLOOKUP('申込一覧（様式１）'!H21,CODE!$P$3:$R$39,2,FALSE))","v":""},{"$f":"IF('申込一覧（様式１）'!I21=\"\",\"\",'申込一覧（様式１）'!I21)","v":""},{"$f":"IF('申込一覧（様式１）'!H21=\"\",\"\",0)","v":""},{"$f":"IF('申込一覧（様式１）'!H21=\"\",\"\",VLOOKUP('申込一覧（様式１）'!H21,CODE!$P$3:$R$39,3,FALSE))","v":""},{"$f":"IF('申込一覧（様式１）'!J21=\"\",\"\",VLOOKUP('申込一覧（様式１）'!J21,CODE!$P$3:$R$39,2,FALSE))","v":""},{"$f":"IF('申込一覧（様式１）'!K21=\"\",\"\",'申込一覧（様式１）'!K21)","v":""},{"$f":"IF('申込一覧（様式１）'!J21=\"\",\"\",0)","v":""},{"$f":"IF('申込一覧（様式１）'!J21=\"\",\"\",VLOOKUP('申込一覧（様式１）'!J21,CODE!$P$3:$R$39,3,FALSE))","v":""}]
{"$rows_left_out":17}
{"sheet":"CODE","index":4,"n_rows":85,"n_cols":21,"rows_kept":85,"hidden":true}
[]
["所属地コード","所属地名","出力順",null,"コード",null,"コード",null,"コード","競技名　男子",null,"コード",null,"コード","競技名　女子",null,"コード",null,null,"競技コード","競技名"]
[49,"空知",1,null,81,"アカシヤ幼稚園",81,null,1,"M 100m","１００ｍ",1,0,36,"W 100m","１００ｍ",36,0,null,1,"中･高･一般男子100m"]
[50,"道南",2,null,82,"駒沢幼稚園",82,null,2,"M 200m","２００ｍ",2,0,37,"W 200m","２００ｍ",37,0,null,2,"中･高･一般男子200m"]
[51,"小樽後志",3,null,83,"天使幼稚園",83,null,3,"M 400m","４００ｍ",3,0,38,"W 800m","８００ｍ",38,0,null,3,"中･高･一般男子400m"]
[52,"室蘭地方",4,null,84,"めぐみ幼稚園",84,null,4,"M 800m","８００ｍ",4,0,39,"W 1500m","１５００ｍ",39,0,null,4,"中･高･一般男子800m"]
[53,"苫小牧",5,null,1,"岩見沢陸上クラブ",1,null,5,"M 1500m","１５００ｍ",5,0,41,"W 走高跳","走高跳",41,2,null,5,"中･高･一般男子1500m"]
[54,"札幌",6,null,2,"美唄ＪＡＣ",2,null,7,"M 走高跳","走高跳",7,2,42,"W 棒高跳","棒高跳",42,2,null,6,"中･高･一般男子4X100mR"]
[55,"道央",7,null,3,"滝川陸上クラブ",3,null,8,"M 棒高跳","棒高跳",8,2,43,"W 走幅跳","走幅跳",43,2,null,7,"中･高･一般男子走高跳"]
[56,"道北",8,null,4,"赤平陸上クラブ",4,null,9,"M 走幅跳","走幅跳",9,2,44,"W 三段跳","三段跳",44,2,null,8,"中･高･一般男子棒高跳"]
[57,"十勝",9,null,5,"深川陸上クラブ",5,null,10,"M 5000m","５０００ｍ",10,0,45,"W 円盤投","円盤投",45,2,null,9,"中･高･一般男子走幅跳"]
[58,"釧路地方",10,null,6,"南幌SAC",6,null,11,"一M 110mH","１１０ｍH",11,0,46,"W 400m","４００ｍ",46,0,null,10,"高校･一般男子5000m"]
[59,"オホーツク",11,null,7,"YRC",7,null,12,"M 400mH","４００ｍH",12,0,47,"W 3000m","３０００ｍ",47,0,null,11,"高校･一般男子110mH(1.067m)"]
[60,"日本　",12,null,11,"夕張ゆうばり小",11,null,13,"M 三段跳","三段跳",13,2,48,"一W 100mH","１００ｍH",48,0,null,12,"高校･一般男子400mH(0.914m)"]
[1,"北海道",13,null,12,"岩見沢北村小",12,null,14,"M やり投","やり投",14,2,49,"W 400mH","４００ｍH",49,0,null,13,"高校･一般男子三段跳"]
{"$rows_left_out":70}